Target
Growth hormone secretagogue receptor type 1
Ligand
BDBM50083977
Substrate
Meas. Tech.
ChEBML_70348
IC50
3500±n/a nM
Citation
 Ye, ZGao, YBakshi, RKChen, MHRohrer, SPFeighner, SDPong, SSHoward, ADBlake, ABirzin, ETLocco, LParmar, RMChan, WWSchaeffer, JMSmith, RGPatchett, AANargund, RP Modeling directed design and biological evaluation of quinazolinones as non-peptidic growth hormone secretagogues. Bioorg Med Chem Lett 10:5-8 (2000)  
Target
Name:
Growth hormone secretagogue receptor type 1
Synonyms:
GH-releasing peptide receptor GHS-R GHSR_HUMAN Ghrelin receptor | Ghrelin receptor 1a (GHS-R1a)
Type:
Receptor
Mol. Mass.:
41334.57
Organism:
Homo sapiens (Human)
Description:
Receptor binding studies use plasma membranes from LLC PK-1 cells transiently transfected with hGHSR1a.
Residue:
366
  
Inhibitor
Name:
BDBM50083977
Synonyms:
6-Amino-2-[2-(6-chloro-2-naphthalen-2-yl-4-oxo-4H-quinazolin-3-yl)-acetylamino]-hexanoic acid methyl ester; hydrochloride | CHEMBL540093
Type:
Small organic molecule
Emp. Form.:
C27H27ClN4O4
Mol. Mass.:
506.981
SMILES:
COC(=O)C(CCCCN)NC(=O)Cn1c(nc2ccc(Cl)cc2c1=O)-c1ccc2ccccc2c1
: