Target
Growth hormone secretagogue receptor type 1
Ligand
BDBM50083979
Substrate
Meas. Tech.
ChEBML_70348
IC50
16±n/a nM
Citation
 Ye, ZGao, YBakshi, RKChen, MHRohrer, SPFeighner, SDPong, SSHoward, ADBlake, ABirzin, ETLocco, LParmar, RMChan, WWSchaeffer, JMSmith, RGPatchett, AANargund, RP Modeling directed design and biological evaluation of quinazolinones as non-peptidic growth hormone secretagogues. Bioorg Med Chem Lett 10:5-8 (2000)  
Target
Name:
Growth hormone secretagogue receptor type 1
Synonyms:
GH-releasing peptide receptor GHS-R GHSR_HUMAN Ghrelin receptor | Ghrelin receptor 1a (GHS-R1a)
Type:
Receptor
Mol. Mass.:
41334.57
Organism:
Homo sapiens (Human)
Description:
Receptor binding studies use plasma membranes from LLC PK-1 cells transiently transfected with hGHSR1a.
Residue:
366
  
Inhibitor
Name:
BDBM50083979
Synonyms:
CHEMBL540604 | N-(6-Amino-hexyl)-2-(4-oxo-2-phenethyl-6-phenyl-4H-quinazolin-3-yl)-acetamide; hydrochloride
Type:
Small organic molecule
Emp. Form.:
C30H34N4O2
Mol. Mass.:
482.6166
SMILES:
NCCCCCCNC(=O)Cn1c(CCc2ccccc2)nc2ccc(cc2c1=O)-c1ccccc1
: