Target
Growth hormone secretagogue receptor type 1
Ligand
BDBM50049478
Substrate
Meas. Tech.
ChEBML_70348
IC50
300±n/a nM
Citation
 Ye, ZGao, YBakshi, RKChen, MHRohrer, SPFeighner, SDPong, SSHoward, ADBlake, ABirzin, ETLocco, LParmar, RMChan, WWSchaeffer, JMSmith, RGPatchett, AANargund, RP Modeling directed design and biological evaluation of quinazolinones as non-peptidic growth hormone secretagogues. Bioorg Med Chem Lett 10:5-8 (2000)  
Target
Name:
Growth hormone secretagogue receptor type 1
Synonyms:
GH-releasing peptide receptor GHS-R GHSR_HUMAN Ghrelin receptor | Ghrelin receptor 1a (GHS-R1a)
Type:
Receptor
Mol. Mass.:
41334.57
Organism:
Homo sapiens (Human)
Description:
Receptor binding studies use plasma membranes from LLC PK-1 cells transiently transfected with hGHSR1a.
Residue:
366
  
Inhibitor
Name:
BDBM50049478
Synonyms:
1-{[(2R)-3-(benzyloxy)-1-{1-methanesulfonyl-1,2-dihydrospiro[indole-3,4'-piperidine]-1'-yl}-1-oxopropan-2-yl]carbamoyl}-1-methylethan-1-aminium 1N-[1-benzyloxymethyl-2-[1-methylsulfonylspiro[2,3-dihydro-1H-indole-3,4'-(hexahydropyridine)]-1-yl]-2-oxo-(1R)-ethyl]-2-amino-2-methylpropanamide [3a(MK-0677)] CHEMBL13817 MK-0677 | MK-677
Type:
Small organic molecule
Emp. Form.:
C27H36N4O5S
Mol. Mass.:
528.664
SMILES:
CC(C)(N)C(=O)N[C@H](COCc1ccccc1)C(=O)N1CCC2(CN(c3ccccc23)S(C)(=O)=O)CC1
: