Target
72 kDa type IV collagenase
Ligand
BDBM50095215
Substrate
Meas. Tech.
ChEBML_104386
IC50
1800±n/a nM
Citation
 Barta, TEBecker, DPBedell, LJDe Crescenzo, GAMcDonald, JJMunie, GERao, SShieh, HSStegeman, RStevens, AMVillamil, CI Synthesis and activity of selective MMP inhibitors with an aryl backbone. Bioorg Med Chem Lett 10:2815-7 (2000)  
Target
Name:
72 kDa type IV collagenase
Synonyms:
72 kDa gelatinase CLG4A Gelatinase A (MMP-2) MMP2_HUMAN Matrix metalloproteinase-2 (MMP 2) Matrix metalloproteinases 2 (MMP-2) | TBE-1
Type:
Enzyme
Mol. Mass.:
73870.36
Organism:
Homo sapiens (Human)
Description:
P08253
Residue:
660
  
Inhibitor
Name:
BDBM50095215
Synonyms:
CHEMBL330078 | N-Hydroxy-2-[3-(4-trifluoromethyl-phenoxy)-pyrrolidine-1-sulfonyl]-benzamide
Type:
Small organic molecule
Emp. Form.:
C18H17F3N2O5S
Mol. Mass.:
430.398
SMILES:
ONC(=O)c1ccccc1S(=O)(=O)N1CCC(C1)Oc1ccc(cc1)C(F)(F)F
: