Target
Collagenase 3
Ligand
BDBM50095215
Substrate
Meas. Tech.
ChEBML_106604
IC50
2000±n/a nM
Citation
 Barta, TEBecker, DPBedell, LJDe Crescenzo, GAMcDonald, JJMunie, GERao, SShieh, HSStegeman, RStevens, AMVillamil, CI Synthesis and activity of selective MMP inhibitors with an aryl backbone. Bioorg Med Chem Lett 10:2815-7 (2000)  
Target
Name:
Collagenase 3
Synonyms:
MMP-13 MMP13_HUMAN Matrix metalloproteinase-13 (MMP-13) | Matrix metalloproteinase-13 (MMP13)
Type:
Enzyme
Mol. Mass.:
53808.06
Organism:
Homo sapiens (Human)
Description:
P45452
Residue:
471
  
Inhibitor
Name:
BDBM50095215
Synonyms:
CHEMBL330078 | N-Hydroxy-2-[3-(4-trifluoromethyl-phenoxy)-pyrrolidine-1-sulfonyl]-benzamide
Type:
Small organic molecule
Emp. Form.:
C18H17F3N2O5S
Mol. Mass.:
430.398
SMILES:
ONC(=O)c1ccccc1S(=O)(=O)N1CCC(C1)Oc1ccc(cc1)C(F)(F)F
: