Target
Prothrombin
Ligand
BDBM50085451
Substrate
Meas. Tech.
ChEMBL_160978 (CHEMBL769319)
Ki
9±n/a nM
Citation
 Hanessian, SBalaux, EMusil, DOlsson, LLNilsson, I Exploring the chiral space within the active site of alpha-thrombin with a constrained mimic of D-Phe-Pro-Arg--design, synthesis, inhibitory activity, and X-ray structure of an enzyme-inhibitor complex. Bioorg Med Chem Lett 10:243-7 (2000)  
Target
Name:
Prothrombin
Synonyms:
Activation peptide fragment 1 Coagulation factor II Prothrombin precursor Thrombin heavy chain | Thrombin light chain
Type:
Protein
Mol. Mass.:
70029.57
Organism:
Homo sapiens (Human)
Description:
P00734
Residue:
622
  
Inhibitor
Name:
BDBM50085451
Synonyms:
(3S,6R,8aS)-6-Benzyl-6-hydroxy-5-oxo-octahydro-indolizine-3-carboxylic acid 4-carbamimidoyl-benzylamide | CHEMBL79705
Type:
Small organic molecule
Emp. Form.:
C24H28N4O3
Mol. Mass.:
420.5041
SMILES:
NC(=N)c1ccc(CNC(=O)[C@@H]2CC[C@H]3CC[C@@](O)(Cc4ccccc4)C(=O)N23)cc1
: