Target
Prothrombin
Ligand
BDBM50085450
Substrate
Meas. Tech.
ChEBML_160979
Ki
125±n/a nM
Citation
 Hanessian, SBalaux, EMusil, DOlsson, LLNilsson, I Exploring the chiral space within the active site of alpha-thrombin with a constrained mimic of D-Phe-Pro-Arg--design, synthesis, inhibitory activity, and X-ray structure of an enzyme-inhibitor complex. Bioorg Med Chem Lett 10:243-7 (2000)  
Target
Name:
Prothrombin
Synonyms:
Activation peptide fragment 1 Coagulation factor II Prothrombin precursor Thrombin heavy chain | Thrombin light chain
Type:
Protein
Mol. Mass.:
70029.57
Organism:
Homo sapiens (Human)
Description:
P00734
Residue:
622
  
Inhibitor
Name:
BDBM50085450
Synonyms:
(3S,6S,8aS)-6-Hydroxy-6-methyl-5-oxo-octahydro-indolizine-3-carboxylic acid 4-carbamimidoyl-benzylamide; hydrochloride | CHEMBL542661
Type:
Small organic molecule
Emp. Form.:
C18H24N4O3
Mol. Mass.:
344.4082
SMILES:
C[C@]1(O)CC[C@@H]2CC[C@H](N2C1=O)C(=O)NCc1ccc(cc1)C(N)=N
: