Target
Phenylethanolamine N-methyltransferase
Ligand
BDBM50028628
Substrate
Meas. Tech.
ChEBML_152560
Ki
1600000±n/a nM
Citation
 Grunewald, GLMcLeish, MJCriscione, KR Phenylethanolamine N-methyltransferase kinetics: bovine versus recombinant human enzyme. Bioorg Med Chem Lett 11:1579-82 (2001)  
Target
Name:
Phenylethanolamine N-methyltransferase
Synonyms:
Noradrenaline N-methyltransferase PNMT_BOVIN | PNMTase
Type:
Enzyme
Mol. Mass.:
30916.97
Organism:
Bos taurus (bovine)
Description:
Residue:
283
  
Inhibitor
Name:
BDBM50028628
Synonyms:
(1R)-1-phenylethanamine (alphaR)-alpha-methylbenzenemethanamine D-alpha-methylbenzylamine
Type:
Small organic molecule
Emp. Form.:
C8H11N
Mol. Mass.:
121.1796
SMILES:
C[C@@H](N)c1ccccc1
: