Target
Carbonic anhydrase 2
Ligand
BDBM50101384
Substrate
Meas. Tech.
ChEBML_45058
Ki
400±n/a nM
Citation
 Mincione, FStarnotti, MMenabuoni, LScozzafava, ACasini, ASupuran, CT Carbonic anhydrase inhibitors: 4-sulfamoyl-benzenecarboxamides and 4-chloro-3-sulfamoyl-benzenecarboxamides with strong topical antiglaucoma properties. Bioorg Med Chem Lett 11:1787-91 (2001)  
Target
Name:
Carbonic anhydrase 2
Synonyms:
CA-II CAC Carbonate dehydratase II Carbonic anhydrase 2 (CA-II) Carbonic anhydrase C Carbonic anhydrase II (CA-II) Carbonic anhydrase II (hCA II) | Carbonic anhydrase isoenzyme II (hCA II)
Type:
Enzyme
Mol. Mass.:
29250.71
Organism:
Homo sapiens (Human)
Description:
P00918
Residue:
260
  
Inhibitor
Name:
BDBM50101384
Synonyms:
4-(4-Chloro-3-sulfamoyl-benzoylamino)-butyric acid | CHEMBL51437
Type:
Small organic molecule
Emp. Form.:
C11H13ClN2O5S
Mol. Mass.:
320.749
SMILES:
NS(=O)(=O)c1cc(ccc1Cl)C(=O)NCCCC(O)=O
: