Target
Carbonic anhydrase 4
Ligand
BDBM50101384
Substrate
Meas. Tech.
ChEBML_45271
Ki
540±n/a nM
Citation
 Mincione, FStarnotti, MMenabuoni, LScozzafava, ACasini, ASupuran, CT Carbonic anhydrase inhibitors: 4-sulfamoyl-benzenecarboxamides and 4-chloro-3-sulfamoyl-benzenecarboxamides with strong topical antiglaucoma properties. Bioorg Med Chem Lett 11:1787-91 (2001)  
Target
Name:
Carbonic anhydrase 4
Synonyms:
CA-IV CAH4_BOVIN Carbonic Anhydrase IV Carbonic anhydrase 4
Type:
Enzyme
Mol. Mass.:
35152.74
Organism:
Bos taurus (bovine)
Description:
Bovine isozyme, isolated from lung microsomes
Residue:
312
  
Inhibitor
Name:
BDBM50101384
Synonyms:
4-(4-Chloro-3-sulfamoyl-benzoylamino)-butyric acid | CHEMBL51437
Type:
Small organic molecule
Emp. Form.:
C11H13ClN2O5S
Mol. Mass.:
320.749
SMILES:
NS(=O)(=O)c1cc(ccc1Cl)C(=O)NCCCC(O)=O
: