Target
Disintegrin and metalloproteinase domain-containing protein 17
Ligand
BDBM50103173
Substrate
Meas. Tech.
ChEBML_207330
IC50
377±n/a nM
Citation
 Levin, JIChen, JDu, MHogan, MKincaid, SNelson, FCVenkatesan, AMWehr, TZask, ADiJoseph, JKillar, LMSkala, SSung, ASharr, MRoth, CJin, GCowling, RMohler, KMBlack, RAMarch, CJSkotnicki, JS The discovery of anthranilic acid-based MMP inhibitors. Part 2: SAR of the 5-position and P1(1) groups. Bioorg Med Chem Lett 11:2189-92 (2001)  
Target
Name:
Disintegrin and metalloproteinase domain-containing protein 17
Synonyms:
ADA17_HUMAN CSVP Disintegrin and metalloproteinase domain-containing protein 17 (ADAM17) TNF-alpha convertase TNF-alpha-converting enzyme (TACE) Tumor necrosis factor-α converting enzyme (TACE)
Type:
Enzyme
Mol. Mass.:
93007.89
Organism:
Homo sapiens (Human)
Description:
Residue:
824
  
Inhibitor
Name:
BDBM50103173
Synonyms:
2-[Benzyl-(4-butoxy-benzenesulfonyl)-amino]-N-hydroxy-3,5-dimethyl-benzamide | CHEMBL307990
Type:
Small organic molecule
Emp. Form.:
C26H30N2O5S
Mol. Mass.:
482.592
SMILES:
CCCCOc1ccc(cc1)S(=O)(=O)N(Cc1ccccc1)c1c(C)cc(C)cc1C(=O)NO
: