Target
Sodium-dependent dopamine transporter
Ligand
BDBM22165
Substrate
Meas. Tech.
ChEBML_62466
Ki
12±n/a nM
Citation
 Cao, JHusbands, SMKopajtic, TKatz, JLNewman, AH [3-cis-3,5-Dimethyl-(1-piperazinyl)alkyl]-bis-(4'-fluorophenyl)amine analogues as novel probes for the dopamine transporter. Bioorg Med Chem Lett 11:3169-73 (2001)  
Target
Name:
Sodium-dependent dopamine transporter
Synonyms:
DA transporter SC6A3_RAT Sodium-dependent dopamine transporter | Sodium-dependent dopamine transporter (DAT)
Type:
Multi-pass membrane protein
Mol. Mass.:
68749.45
Organism:
Rattus norvegicus (rat)
Description:
P23977
Residue:
619
  
Inhibitor
Name:
BDBM22165
Synonyms:
1-{2-[bis(4-fluorophenyl)methoxy]ethyl}-4-(3-phenylpropyl)piperazine CHEMBL281594 CHEMBL543876 GBR-12909 US9944618, Compound ID No. 175 | Vanoxerine
Type:
Small organic molecule
Emp. Form.:
C28H32F2N2O
Mol. Mass.:
450.5633
SMILES:
Fc1ccc(cc1)C(OCCN1CCN(CCCc2ccccc2)CC1)c1ccc(F)cc1
: