Target
Carbonic anhydrase 2
Ligand
BDBM50219173
Substrate
Meas. Tech.
ChEMBL_219472 (CHEMBL824220)
Ki
9±n/a nM
Citation
 Scozzafava, AMenabuoni, LMincione, FMincione, GSupuran, CT Carbonic anhydrase inhibitors: synthesis of sulfonamides incorporating dtpa tails and of their zinc complexes with powerful topical antiglaucoma properties. Bioorg Med Chem Lett 11:575-82 (2001)  
Target
Name:
Carbonic anhydrase 2
Synonyms:
CA-II CAC Carbonate dehydratase II Carbonic anhydrase 2 (CA-II) Carbonic anhydrase C Carbonic anhydrase II (CA-II) Carbonic anhydrase II (hCA II) | Carbonic anhydrase isoenzyme II (hCA II)
Type:
Enzyme
Mol. Mass.:
29250.71
Organism:
Homo sapiens (Human)
Description:
P00918
Residue:
260
  
Inhibitor
Name:
BDBM50219173
Synonyms:
CHEMBL2112276
Type:
Small organic molecule
Emp. Form.:
C28H37N7O12S2Zn
Mol. Mass.:
793.172
SMILES:
[Zn++].NS(=O)(=O)c1ccc(CNC(=O)CN(CCN(CCN(CC([O-])=O)CC(=O)NCc2ccc(cc2)S(N)(=O)=O)CC([O-])=O)CC(O)=O)cc1
: