Target
Carbonic anhydrase 4
Ligand
BDBM50219176
Substrate
Meas. Tech.
ChEMBL_219473 (CHEMBL824221)
Ki
5±n/a nM
Citation
 Scozzafava, AMenabuoni, LMincione, FMincione, GSupuran, CT Carbonic anhydrase inhibitors: synthesis of sulfonamides incorporating dtpa tails and of their zinc complexes with powerful topical antiglaucoma properties. Bioorg Med Chem Lett 11:575-82 (2001)  
Target
Name:
Carbonic anhydrase 4
Synonyms:
CA-IV CAH4_HUMAN Carbonic anhydrase Carbonic anhydrase IV (CA IV)
Type:
Enzyme
Mol. Mass.:
35037.98
Organism:
Homo sapiens (Human)
Description:
P22748
Residue:
312
  
Inhibitor
Name:
BDBM50219176
Synonyms:
CHEMBL2111218
Type:
Small organic molecule
Emp. Form.:
C20H29N11O12S4Zn
Mol. Mass.:
809.18
SMILES:
[Zn++].Cn1nc(s\c1=N\C(=O)CN(CCN(CCN(CC([O-])=O)CC(=O)\N=c1/sc(nn1C)S(N)(=O)=O)CC([O-])=O)CC(O)=O)S(N)(=O)=O
: