Target
Carbonic anhydrase 2
Ligand
BDBM50097274
Substrate
Meas. Tech.
ChEBML_219472
Ki
10±n/a nM
Citation
 Scozzafava, AMenabuoni, LMincione, FMincione, GSupuran, CT Carbonic anhydrase inhibitors: synthesis of sulfonamides incorporating dtpa tails and of their zinc complexes with powerful topical antiglaucoma properties. Bioorg Med Chem Lett 11:575-82 (2001)  
Target
Name:
Carbonic anhydrase 2
Synonyms:
CA-II CAC Carbonate dehydratase II Carbonic anhydrase 2 (CA-II) Carbonic anhydrase C Carbonic anhydrase II (CA-II) Carbonic anhydrase II (hCA II) | Carbonic anhydrase isoenzyme II (hCA II)
Type:
Enzyme
Mol. Mass.:
29250.71
Organism:
Homo sapiens (Human)
Description:
P00918
Residue:
260
  
Inhibitor
Name:
BDBM50097274
Synonyms:
(Carboxymethyl-{2-[carboxymethyl-(2-{carboxymethyl-[(2,3-dichloro-4,6-disulfamoyl-phenylcarbamoyl)-methyl]-amino}-ethyl)-amino]-ethyl}-amino)-acetic acid {(2-{[2-(Bis-carboxymethyl-amino)-ethyl]-carboxymethyl-amino}-ethyl)-[(2,3-dichloro-4,6-disulfamoyl-phenylcarbamoyl)-methyl]-amino}-acetic acid
Type:
Small organic molecule
Emp. Form.:
C20H28Cl2N6O13S2
Mol. Mass.:
695.505
SMILES:
NS(=O)(=O)c1cc(c(NC(=O)CN(CCN(CCN(CC(O)=O)CC(O)=O)CC(O)=O)CC(O)=O)c(Cl)c1Cl)S(N)(=O)=O
: