Target
Carbonic anhydrase 2
Ligand
BDBM50097283
Substrate
Meas. Tech.
ChEBML_219472
Ki
11±n/a nM
Citation
 Scozzafava, AMenabuoni, LMincione, FMincione, GSupuran, CT Carbonic anhydrase inhibitors: synthesis of sulfonamides incorporating dtpa tails and of their zinc complexes with powerful topical antiglaucoma properties. Bioorg Med Chem Lett 11:575-82 (2001)  
Target
Name:
Carbonic anhydrase 2
Synonyms:
CA-II CAC Carbonate dehydratase II Carbonic anhydrase 2 (CA-II) Carbonic anhydrase C Carbonic anhydrase II (CA-II) Carbonic anhydrase II (hCA II) | Carbonic anhydrase isoenzyme II (hCA II)
Type:
Enzyme
Mol. Mass.:
29250.71
Organism:
Homo sapiens (Human)
Description:
P00918
Residue:
260
  
Inhibitor
Name:
BDBM50097283
Synonyms:
CHEMBL284831 | {{2-[Carboxymethyl-(2-{carboxymethyl-[(5-chloro-2,4-disulfamoyl-phenylcarbamoyl)-methyl]-amino}-ethyl)-amino]-ethyl}-[(5-chloro-2,4-disulfamoyl-phenylcarbamoyl)-methyl]-amino}-acetic acid
Type:
Small organic molecule
Emp. Form.:
C26H35Cl2N9O16S4
Mol. Mass.:
928.773
SMILES:
NS(=O)(=O)c1cc(c(NC(=O)CN(CCN(CCN(CC(O)=O)CC(=O)Nc2cc(Cl)c(cc2S(N)(=O)=O)S(N)(=O)=O)CC(O)=O)CC(O)=O)cc1Cl)S(N)(=O)=O
: