Target
Carbonic anhydrase 4
Ligand
BDBM50079049
Substrate
Meas. Tech.
ChEBML_219473
Ki
15±n/a nM
Citation
 Scozzafava, AMenabuoni, LMincione, FMincione, GSupuran, CT Carbonic anhydrase inhibitors: synthesis of sulfonamides incorporating dtpa tails and of their zinc complexes with powerful topical antiglaucoma properties. Bioorg Med Chem Lett 11:575-82 (2001)  
Target
Name:
Carbonic anhydrase 4
Synonyms:
CA-IV CAH4_HUMAN Carbonic anhydrase Carbonic anhydrase IV (CA IV)
Type:
Enzyme
Mol. Mass.:
35037.98
Organism:
Homo sapiens (Human)
Description:
P22748
Residue:
312
  
Inhibitor
Name:
BDBM50079049
Synonyms:
6-(2-Hydroxy-ethoxy)-benzothiazole-2-sulfonic acid amide CHEMBL287117
Type:
Small organic molecule
Emp. Form.:
C9H10N2O4S2
Mol. Mass.:
274.317
SMILES:
NS(=O)(=O)c1nc2ccc(OCCO)cc2s1
: