Target
Carbonic anhydrase 2
Ligand
BDBM50079035
Substrate
Meas. Tech.
ChEBML_219472
Ki
9±n/a nM
Citation
 Scozzafava, AMenabuoni, LMincione, FMincione, GSupuran, CT Carbonic anhydrase inhibitors: synthesis of sulfonamides incorporating dtpa tails and of their zinc complexes with powerful topical antiglaucoma properties. Bioorg Med Chem Lett 11:575-82 (2001)  
Target
Name:
Carbonic anhydrase 2
Synonyms:
CA-II CAC Carbonate dehydratase II Carbonic anhydrase 2 (CA-II) Carbonic anhydrase C Carbonic anhydrase II (CA-II) Carbonic anhydrase II (hCA II) | Carbonic anhydrase isoenzyme II (hCA II)
Type:
Enzyme
Mol. Mass.:
29250.71
Organism:
Homo sapiens (Human)
Description:
P00918
Residue:
260
  
Inhibitor
Name:
BDBM50079035
Synonyms:
6-Amino-benzothiazole-2-sulfonic acid amide CHEMBL35118
Type:
Small organic molecule
Emp. Form.:
C7H7N3O2S2
Mol. Mass.:
229.279
SMILES:
Nc1ccc2nc(sc2c1)S(N)(=O)=O
: