Target
Carbonic anhydrase 2
Ligand
BDBM50097303
Substrate
Meas. Tech.
ChEBML_219472
Ki
0.500000±n/a nM
Citation
 Scozzafava, AMenabuoni, LMincione, FMincione, GSupuran, CT Carbonic anhydrase inhibitors: synthesis of sulfonamides incorporating dtpa tails and of their zinc complexes with powerful topical antiglaucoma properties. Bioorg Med Chem Lett 11:575-82 (2001)  
Target
Name:
Carbonic anhydrase 2
Synonyms:
CA-II CAC Carbonate dehydratase II Carbonic anhydrase 2 (CA-II) Carbonic anhydrase C Carbonic anhydrase II (CA-II) Carbonic anhydrase II (hCA II) | Carbonic anhydrase isoenzyme II (hCA II)
Type:
Enzyme
Mol. Mass.:
29250.71
Organism:
Homo sapiens (Human)
Description:
P00918
Residue:
260
  
Inhibitor
Name:
BDBM50097303
Synonyms:
CHEMBL346691 | {{2-[Carboxymethyl-(2-{carboxymethyl-[2-(2-sulfamoyl-benzothiazol-6-yloxy)-ethoxycarbonylmethyl]-amino}-ethyl)-amino]-ethyl}-[2-(2-sulfamoyl-benzothiazol-6-yloxy)-ethoxycarbonylmethyl]-amino}-acetic acid
Type:
Small organic molecule
Emp. Form.:
C32H39N7O16S4
Mol. Mass.:
905.949
SMILES:
NS(=O)(=O)c1nc2ccc(OCCOC(=O)CN(CCN(CCN(CC(O)=O)CC(=O)OCCOc3ccc4nc(sc4c3)S(N)(=O)=O)CC(O)=O)CC(O)=O)cc2s1
: