Target
Carbonic anhydrase 4
Ligand
BDBM50097303
Substrate
Meas. Tech.
ChEBML_219473
Ki
4±n/a nM
Citation
 Scozzafava, AMenabuoni, LMincione, FMincione, GSupuran, CT Carbonic anhydrase inhibitors: synthesis of sulfonamides incorporating dtpa tails and of their zinc complexes with powerful topical antiglaucoma properties. Bioorg Med Chem Lett 11:575-82 (2001)  
Target
Name:
Carbonic anhydrase 4
Synonyms:
CA-IV CAH4_HUMAN Carbonic anhydrase Carbonic anhydrase IV (CA IV)
Type:
Enzyme
Mol. Mass.:
35037.98
Organism:
Homo sapiens (Human)
Description:
P22748
Residue:
312
  
Inhibitor
Name:
BDBM50097303
Synonyms:
CHEMBL346691 | {{2-[Carboxymethyl-(2-{carboxymethyl-[2-(2-sulfamoyl-benzothiazol-6-yloxy)-ethoxycarbonylmethyl]-amino}-ethyl)-amino]-ethyl}-[2-(2-sulfamoyl-benzothiazol-6-yloxy)-ethoxycarbonylmethyl]-amino}-acetic acid
Type:
Small organic molecule
Emp. Form.:
C32H39N7O16S4
Mol. Mass.:
905.949
SMILES:
NS(=O)(=O)c1nc2ccc(OCCOC(=O)CN(CCN(CCN(CC(O)=O)CC(=O)OCCOc3ccc4nc(sc4c3)S(N)(=O)=O)CC(O)=O)CC(O)=O)cc2s1
: