Target
Carbonic anhydrase 4
Ligand
BDBM50097289
Substrate
Meas. Tech.
ChEBML_219473
Ki
9±n/a nM
Citation
 Scozzafava, AMenabuoni, LMincione, FMincione, GSupuran, CT Carbonic anhydrase inhibitors: synthesis of sulfonamides incorporating dtpa tails and of their zinc complexes with powerful topical antiglaucoma properties. Bioorg Med Chem Lett 11:575-82 (2001)  
Target
Name:
Carbonic anhydrase 4
Synonyms:
CA-IV CAH4_HUMAN Carbonic anhydrase Carbonic anhydrase IV (CA IV)
Type:
Enzyme
Mol. Mass.:
35037.98
Organism:
Homo sapiens (Human)
Description:
P22748
Residue:
312
  
Inhibitor
Name:
BDBM50097289
Synonyms:
((2-{Carboxymethyl-[2-(carboxymethyl-{[3-methyl-5-sulfamoyl-3H-[1,3,4]thiadiazol-(2Z)-ylidenecarbamoyl]-methyl}-amino)-ethyl]-amino}-ethyl)-{[3-methyl-5-sulfamoyl-3H-[1,3,4]thiadiazol-(2E)-ylidenecarbamoyl]-methyl}-amino)-acetic acid CHEMBL1795056 Zinc; {{2-[Carboxymethyl-(2-{carboxymethyl-[(3-methyl-5-sulfamoyl-3H-[1,3,4]thiadiazol-2-ylidenecarbamoyl)-methyl]-amino}-ethyl)-amino]-ethyl}-[(3-methyl-5-sulfamoyl-3H-[1,3,4]thiadiazol-2-ylidenecarbamoyl)-methyl]-amino}-acetic acid
Type:
Small organic molecule
Emp. Form.:
C20H31N11O12S4
Mol. Mass.:
745.787
SMILES:
Cn1nc(sc1=NC(=O)CN(CCN(CCN(CC(O)=O)CC(=O)N=c1sc(nn1C)S(N)(=O)=O)CC(O)=O)CC(O)=O)S(N)(=O)=O
: