Target
Carbonic anhydrase 2
Ligand
BDBM50097285
Substrate
Meas. Tech.
ChEBML_219472
Ki
13±n/a nM
Citation
 Scozzafava, AMenabuoni, LMincione, FMincione, GSupuran, CT Carbonic anhydrase inhibitors: synthesis of sulfonamides incorporating dtpa tails and of their zinc complexes with powerful topical antiglaucoma properties. Bioorg Med Chem Lett 11:575-82 (2001)  
Target
Name:
Carbonic anhydrase 2
Synonyms:
CA-II CAC Carbonate dehydratase II Carbonic anhydrase 2 (CA-II) Carbonic anhydrase C Carbonic anhydrase II (CA-II) Carbonic anhydrase II (hCA II) | Carbonic anhydrase isoenzyme II (hCA II)
Type:
Enzyme
Mol. Mass.:
29250.71
Organism:
Homo sapiens (Human)
Description:
P00918
Residue:
260
  
Inhibitor
Name:
BDBM50097285
Synonyms:
(Carboxymethyl-{2-[carboxymethyl-(2-{carboxymethyl-[(2-fluoro-4-sulfamoyl-phenylcarbamoyl)-methyl]-amino}-ethyl)-amino]-ethyl}-amino)-acetic acid {(2-{[2-(Bis-carboxymethyl-amino)-ethyl]-carboxymethyl-amino}-ethyl)-[(2-fluoro-4-sulfamoyl-phenylcarbamoyl)-methyl]-amino}-acetic acid
Type:
Small organic molecule
Emp. Form.:
C20H28FN5O11S
Mol. Mass.:
565.527
SMILES:
NS(=O)(=O)c1ccc(NC(=O)CN(CCN(CCN(CC(O)=O)CC(O)=O)CC(O)=O)CC(O)=O)c(F)c1
: