Target
Carbonic anhydrase 2
Ligand
BDBM50097301
Substrate
Meas. Tech.
ChEBML_219472
Ki
9±n/a nM
Citation
 Scozzafava, AMenabuoni, LMincione, FMincione, GSupuran, CT Carbonic anhydrase inhibitors: synthesis of sulfonamides incorporating dtpa tails and of their zinc complexes with powerful topical antiglaucoma properties. Bioorg Med Chem Lett 11:575-82 (2001)  
Target
Name:
Carbonic anhydrase 2
Synonyms:
CA-II CAC Carbonate dehydratase II Carbonic anhydrase 2 (CA-II) Carbonic anhydrase C Carbonic anhydrase II (CA-II) Carbonic anhydrase II (hCA II) | Carbonic anhydrase isoenzyme II (hCA II)
Type:
Enzyme
Mol. Mass.:
29250.71
Organism:
Homo sapiens (Human)
Description:
P00918
Residue:
260
  
Inhibitor
Name:
BDBM50097301
Synonyms:
CHEMBL30168 | {{2-[Carboxymethyl-(2-{carboxymethyl-[(2-iodo-4-sulfamoyl-phenylcarbamoyl)-methyl]-amino}-ethyl)-amino]-ethyl}-[(2-iodo-4-sulfamoyl-phenylcarbamoyl)-methyl]-amino}-acetic acid
Type:
Small organic molecule
Emp. Form.:
C26H33I2N7O12S2
Mol. Mass.:
953.519
SMILES:
NS(=O)(=O)c1ccc(NC(=O)CN(CCN(CCN(CC(O)=O)CC(=O)Nc2ccc(cc2I)S(N)(=O)=O)CC(O)=O)CC(O)=O)c(I)c1
: