Target
Carbonic anhydrase 2
Ligand
BDBM50097300
Substrate
Meas. Tech.
ChEBML_219472
Ki
0.900000±n/a nM
Citation
 Scozzafava, AMenabuoni, LMincione, FMincione, GSupuran, CT Carbonic anhydrase inhibitors: synthesis of sulfonamides incorporating dtpa tails and of their zinc complexes with powerful topical antiglaucoma properties. Bioorg Med Chem Lett 11:575-82 (2001)  
Target
Name:
Carbonic anhydrase 2
Synonyms:
CA-II CAC Carbonate dehydratase II Carbonic anhydrase 2 (CA-II) Carbonic anhydrase C Carbonic anhydrase II (CA-II) Carbonic anhydrase II (hCA II) | Carbonic anhydrase isoenzyme II (hCA II)
Type:
Enzyme
Mol. Mass.:
29250.71
Organism:
Homo sapiens (Human)
Description:
P00918
Residue:
260
  
Inhibitor
Name:
BDBM50097300
Synonyms:
(Carboxymethyl-{2-[carboxymethyl-(2-{carboxymethyl-[(5-sulfamoyl-[1,3,4]thiadiazol-2-ylcarbamoyl)-methyl]-amino}-ethyl)-amino]-ethyl}-amino)-acetic acid | CHEMBL32606
Type:
Small organic molecule
Emp. Form.:
C16H25N7O11S2
Mol. Mass.:
555.54
SMILES:
NS(=O)(=O)c1nnc(NC(=O)CN(CCN(CCN(CC(O)=O)CC(O)=O)CC(O)=O)CC(O)=O)s1
: