Target
Carbonic anhydrase 2
Ligand
BDBM50097313
Substrate
Meas. Tech.
ChEBML_219472
Ki
10±n/a nM
Citation
 Scozzafava, AMenabuoni, LMincione, FMincione, GSupuran, CT Carbonic anhydrase inhibitors: synthesis of sulfonamides incorporating dtpa tails and of their zinc complexes with powerful topical antiglaucoma properties. Bioorg Med Chem Lett 11:575-82 (2001)  
Target
Name:
Carbonic anhydrase 2
Synonyms:
CA-II CAC Carbonate dehydratase II Carbonic anhydrase 2 (CA-II) Carbonic anhydrase C Carbonic anhydrase II (CA-II) Carbonic anhydrase II (hCA II) | Carbonic anhydrase isoenzyme II (hCA II)
Type:
Enzyme
Mol. Mass.:
29250.71
Organism:
Homo sapiens (Human)
Description:
P00918
Residue:
260
  
Inhibitor
Name:
BDBM50097313
Synonyms:
([(2-Bromo-4-sulfamoyl-phenylcarbamoyl)-methyl]-{2-[(2-{[(2-bromo-4-sulfamoyl-phenylcarbamoyl)-methyl]-carboxymethyl-amino}-ethyl)-carboxymethyl-amino]-ethyl}-amino)-acetic acid | CHEMBL287316
Type:
Small organic molecule
Emp. Form.:
C26H33Br2N7O12S2
Mol. Mass.:
859.518
SMILES:
NS(=O)(=O)c1ccc(NC(=O)CN(CCN(CCN(CC(O)=O)CC(=O)Nc2ccc(cc2Br)S(N)(=O)=O)CC(O)=O)CC(O)=O)c(Br)c1
: