Target
Carbonic anhydrase 2
Ligand
BDBM50097298
Substrate
Meas. Tech.
ChEBML_219472
Ki
0.800000±n/a nM
Citation
 Scozzafava, AMenabuoni, LMincione, FMincione, GSupuran, CT Carbonic anhydrase inhibitors: synthesis of sulfonamides incorporating dtpa tails and of their zinc complexes with powerful topical antiglaucoma properties. Bioorg Med Chem Lett 11:575-82 (2001)  
Target
Name:
Carbonic anhydrase 2
Synonyms:
CA-II CAC Carbonate dehydratase II Carbonic anhydrase 2 (CA-II) Carbonic anhydrase C Carbonic anhydrase II (CA-II) Carbonic anhydrase II (hCA II) | Carbonic anhydrase isoenzyme II (hCA II)
Type:
Enzyme
Mol. Mass.:
29250.71
Organism:
Homo sapiens (Human)
Description:
P00918
Residue:
260
  
Inhibitor
Name:
BDBM50097298
Synonyms:
CHEMBL34317 | [(2-{[2-(Bis-carboxymethyl-amino)-ethyl]-carboxymethyl-amino}-ethyl)-(2-sulfamoyl-benzothiazol-6-yloxycarbonylmethyl)-amino]-acetic acid
Type:
Small organic molecule
Emp. Form.:
C21H27N5O12S2
Mol. Mass.:
605.595
SMILES:
NS(=O)(=O)c1nc2ccc(OC(=O)CN(CCN(CCN(CC(O)=O)CC(O)=O)CC(O)=O)CC(O)=O)cc2s1
: