Target
Protein farnesyltransferase subunit beta/geranylgeranyltransferase type-1 subunit alpha
Ligand
BDBM50098037
Substrate
Meas. Tech.
ChEMBL_70304 (CHEMBL677851)
IC50
517±n/a nM
Citation
 Trotter, BWQuigley, AGLumma, WCSisko, JTWalsh, ESHamann, CSRobinson, RGBhimnathwala, HKolodin, DGZheng, WBuser, CAHuber, HELobell, RBKohl, NEWilliams, TMGraham, SLDinsmore, CJ 2-Arylindole-3-acetamides: FPP-competitive inhibitors of farnesyl protein transferase. Bioorg Med Chem Lett 11:865-9 (2001)  
Target
Name:
Protein farnesyltransferase subunit beta/geranylgeranyltransferase type-1 subunit alpha
Synonyms:
Farnesyltransferase (FTase) Protein Farnesyltransferase (PFT) Chain B | Protein farnesyltransferase
Type:
Protein Complex
Mol. Mass.:
Description:
To express recombinant enzyme in E. coli, the cloned human alpha and beta subunits were co-expressed from a plasmid, in which their expression was translationally coupled.
Components:
This complex has 2 components.
Component 1
Name:
Protein farnesyltransferase subunit beta
Synonyms:
CAAX farnesyltransferase subunit alpha FNTB FTase-alpha GGTase-I-alpha Protein farnesyl/geranylgeranyl transferase Protein farnesyltransferase subunit beta Protein farnesyltransferase/geranylgeranyltransferase type-1 subunit alpha Ras proteins prenyltransferase subunit beta | Type I protein geranyl-geranyltransferase subunit alpha
Type:
Enzyme Subunit
Mol. Mass.:
48766.02
Organism:
Homo sapiens (Human)
Description:
Protein farnesyltransferase subunit beta
Residue:
437
  
Component 2
Name:
Protein farnesyltransferase/geranylgeranyltransferase type-1 subunit alpha
Synonyms:
CAAX farnesyltransferase alpha subunit FNTA_HUMAN FTase-alpha Geranylgeranyl Transferase (GGTase-I) Chain A Protein Farnesyltransferase (PFT) Chain A Protein farnesyltransferase Protein farnesyltransferase/geranylgeranyltransferase type I alpha subunit | Ras proteins prenyltransferase alpha
Type:
Enzyme
Mol. Mass.:
44392.46
Organism:
Homo sapiens (Human)
Description:
Recombinant human FTase.
Residue:
379
  
Inhibitor
Name:
BDBM50098037
Synonyms:
4-[3-(4-Cyano-benzyl)-3H-imidazol-4-ylmethyl]-piperazine-1-carboxylic acid adamantan-1-ylamide | CHEMBL424564
Type:
Small organic molecule
Emp. Form.:
C27H34N6O
Mol. Mass.:
458.5985
SMILES:
O=C(NC12CC3CC(CC(C3)C1)C2)N1CCN(Cc2cncn2Cc2ccc(cc2)C#N)CC1
: