Target
Collagenase 3
Ligand
BDBM50098915
Substrate
Meas. Tech.
ChEBML_106619
IC50
0.340000±n/a nM
Citation
 Pikul, SDunham, KMAlmstead, NGDe, BNatchus, MGTaiwo, YOWilliams, LEHynd, BAHsieh, LCJanusz, MJGu, FMieling, GE Heterocycle-based MMP inhibitors with P2' substituents. Bioorg Med Chem Lett 11:1009-13 (2001)  
Target
Name:
Collagenase 3
Synonyms:
Collagenase 3 MMP13_RAT Matrix metalloproteinase-13 UMRCASE
Type:
PROTEIN
Mol. Mass.:
53359.23
Organism:
Rattus norvegicus
Description:
ChEMBL_424298
Residue:
466
  
Inhibitor
Name:
BDBM50098915
Synonyms:
(R)-1-tert-Butyl-3-(4-methoxy-benzenesulfonyl)-6-oxo-hexahydro-pyrimidine-4-carboxylic acid hydroxyamide | CHEMBL7108
Type:
Small organic molecule
Emp. Form.:
C16H23N3O6S
Mol. Mass.:
385.435
SMILES:
COc1ccc(cc1)S(=O)(=O)N1CN(C(=O)C[C@@H]1C(=O)NO)C(C)(C)C
: