Target
Methionine--tRNA ligase, cytoplasmic
Ligand
BDBM50099102
Substrate
Meas. Tech.
ChEBML_67947
IC50
78000±n/a nM
Citation
 Lee, JKang, SUKim, SYKim, SEJob, YJKim, S Vanilloid and isovanilloid analogues as inhibitors of methionyl-tRNA and isoleucyl-tRNA synthetases. Bioorg Med Chem Lett 11:965-8 (2001)  
Target
Name:
Methionine--tRNA ligase, cytoplasmic
Synonyms:
MARS Methionyl-tRNA synthetase | SYMC_HUMAN
Type:
PROTEIN
Mol. Mass.:
101110.04
Organism:
Homo sapiens (Human)
Description:
ChEMBL_105283
Residue:
900
  
Inhibitor
Name:
BDBM50099102
Synonyms:
(S)-1-[2-(3-Hydroxy-4-methoxy-benzoylamino)-ethoxycarbonyl]-3-methylsulfanyl-propyl-ammonium
Type:
Small organic molecule
Emp. Form.:
C15H23N2O5S
Mol. Mass.:
343.418
SMILES:
COc1ccc(cc1O)C(=O)NCCOC(=O)[C@@H]([NH3+])CCSC
: