Target
Isoleucine--tRNA ligase, cytoplasmic
Ligand
BDBM50099112
Substrate
Meas. Tech.
ChEBML_67938
IC50
228000±n/a nM
Citation
 Lee, JKang, SUKim, SYKim, SEJob, YJKim, S Vanilloid and isovanilloid analogues as inhibitors of methionyl-tRNA and isoleucyl-tRNA synthetases. Bioorg Med Chem Lett 11:965-8 (2001)  
Target
Name:
Isoleucine--tRNA ligase, cytoplasmic
Synonyms:
IARS Isoleucyl-tRNA synthetase | SYIC_HUMAN
Type:
PROTEIN
Mol. Mass.:
144489.34
Organism:
Homo sapiens (Human)
Description:
ChEMBL_88804
Residue:
1262
  
Inhibitor
Name:
BDBM50099112
Synonyms:
(S)-1-(2-{Hydroxy-[2-(4-hydroxy-3-methoxy-phenyl)-acetyl]-amino}-ethoxycarbonyl)-2-methyl-butyl-ammonium
Type:
Small organic molecule
Emp. Form.:
C17H27N2O6
Mol. Mass.:
355.4055
SMILES:
CCC(C)[C@H]([NH3+])C(=O)OCCN(O)C(=O)Cc1ccc(O)c(OC)c1
: