Target
Neuronal acetylcholine receptor subunit alpha-3/beta-2
Ligand
BDBM50099564
Substrate
Meas. Tech.
ChEMBL_143559 (CHEMBL755331)
Ki
12200±n/a nM
Citation
 Xu, RDwoskin, LPGrinevich, VPDeaciuc, GCrooks, PA Neuronal nicotinic acetylcholine receptor binding affinities of boron-containing nicotine analogues. Bioorg Med Chem Lett 11:1245-8 (2001)  
Target
Name:
Neuronal acetylcholine receptor subunit alpha-3/beta-2
Synonyms:
Neuronal acetylcholine receptor Alpha-3/Beta-2 Neuronal acetylcholine receptor; alpha3/beta2 | nAChR subtypes alpha3 beta2
Type:
Protein
Mol. Mass.:
Description:
Components:
This complex has 2 components.
Component 1
Name:
Neuronal acetylcholine receptor subunit alpha-3
Synonyms:
ACHA3_RAT Chrna3
Type:
Enzyme
Mol. Mass.:
56995.52
Organism:
Rattus norvegicus (Rat)
Description:
P04757
Residue:
499
  
Component 2
Name:
Neuronal acetylcholine receptor subunit beta-2
Synonyms:
ACHB2_RAT Chrnb2 Neuronal acetylcholine receptor non-alpha-1 chain
Type:
Enzyme
Mol. Mass.:
56910.32
Organism:
Rattus norvegicus (Rat)
Description:
P12390
Residue:
500
  
Inhibitor
Name:
BDBM50099564
Synonyms:
(3aR,9bS)-1-Methyl-2,3,3a,4,5,9b-hexahydro-1H-pyrrolo[2,3-f]quinoline | CHEMBL281410
Type:
Small organic molecule
Emp. Form.:
C12H16N2
Mol. Mass.:
188.2688
SMILES:
CN1CC[C@H]2CCc3ncccc3[C@@H]12
: