Target
Neuronal acetylcholine receptor subunit alpha-7
Ligand
BDBM50099564
Substrate
Meas. Tech.
ChEBML_144170
Ki
>100000±n/a nM
Citation
 Xu, RDwoskin, LPGrinevich, VPDeaciuc, GCrooks, PA Neuronal nicotinic acetylcholine receptor binding affinities of boron-containing nicotine analogues. Bioorg Med Chem Lett 11:1245-8 (2001)  
Target
Name:
Neuronal acetylcholine receptor subunit alpha-7
Synonyms:
ACHA7_RAT Cholinergic, Nicotinic Alpha7 Chrna7 Neuronal acetylcholine receptor (alpha7 nAChR) Neuronal acetylcholine receptor subunit alpha-7 Neuronal acetylcholine receptor subunit alpha-7 (nAChR)
Type:
Enzyme
Mol. Mass.:
56502.44
Organism:
Rattus norvegicus (Rat)
Description:
Q05941
Residue:
502
  
Inhibitor
Name:
BDBM50099564
Synonyms:
(3aR,9bS)-1-Methyl-2,3,3a,4,5,9b-hexahydro-1H-pyrrolo[2,3-f]quinoline | CHEMBL281410
Type:
Small organic molecule
Emp. Form.:
C12H16N2
Mol. Mass.:
188.2688
SMILES:
CN1CC[C@H]2CCc3ncccc3[C@@H]12
: