Target
cGMP-inhibited 3',5'-cyclic phosphodiesterase 3A/3B
Ligand
BDBM50085135
Substrate
Meas. Tech.
ChEMBL_156604 (CHEMBL759686)
IC50
>10000±n/a nM
Citation
 Hersperger, RDawson, JMueller, T Synthesis of 4-(8-benzo[1,2,5]oxadiazol-5-yl-[1,7]naphthyridine-6-yl)-benzoic acid: a potent and selective phosphodiesterase type 4D inhibitor. Bioorg Med Chem Lett 12:233-5 (2001)  
Target
Name:
cGMP-inhibited 3',5'-cyclic phosphodiesterase 3A/3B
Synonyms:
Phosphodiesterase (PDE3) Phosphodiesterase 3 (PDE3) | cGMP-inhibited 3',5'-cyclic phosphodiesterase A/B
Type:
Mol. Mass.:
Description:
ASSAY_ID of ChEMBL is 156458
Components:
This complex has 2 components.
Component 1
Name:
cGMP-inhibited 3',5'-cyclic phosphodiesterase 3B
Synonyms:
CGI-PDE B CGIPDE1 PDE3B Phosphodiesterase 3B Phosphodiesterase Type 3 (PDE3B) cGMP-inhibited 3,5-cyclic phosphodiesterase B
Type:
Enzyme
Mol. Mass.:
124318.95
Organism:
Homo sapiens (Human)
Description:
PDE3B was generated from the full-length recombinant human clone transfected into Sf9 cells.
Residue:
1112
  
Component 2
Name:
cGMP-inhibited 3',5'-cyclic phosphodiesterase 3A
Synonyms:
3',5'-cyclic phosphodiesterase Cyclic GMP-inhibited phosphodiesterase A PDE3A_HUMAN Phosphodiesterase 3 (PDE3) Phosphodiesterase 3A Phosphodiesterase 3A (PDE3A1) cGMP-inhibited 3',5'-cyclic phosphodiesterase A | cGMP-inhibited 3,5-cyclic phosphodiesterase A
Type:
Enzyme
Mol. Mass.:
124966.46
Organism:
Homo sapiens (Human)
Description:
Q14432
Residue:
1141
  
Inhibitor
Name:
BDBM50085135
Synonyms:
4-(8-(3-nitrophenyl)-1,7-naphthyridin-6-yl)benzoic acid 4-[8-(3-nitrophenyl)-1,7-naphthyridin-6-yl]benzoic acid | CHEMBL74078
Type:
Small organic molecule
Emp. Form.:
C21H13N3O4
Mol. Mass.:
371.3456
SMILES:
OC(=O)c1ccc(cc1)-c1cc2cccnc2c(n1)-c1cccc(c1)[N+]([O-])=O
: