Target
cAMP-specific 3',5'-cyclic phosphodiesterase 4A
Ligand
BDBM50085135
Substrate
Meas. Tech.
ChEBML_155038
IC50
88±n/a nM
Citation
 Hersperger, RDawson, JMueller, T Synthesis of 4-(8-benzo[1,2,5]oxadiazol-5-yl-[1,7]naphthyridine-6-yl)-benzoic acid: a potent and selective phosphodiesterase type 4D inhibitor. Bioorg Med Chem Lett 12:233-5 (2001)  
Target
Name:
cAMP-specific 3',5'-cyclic phosphodiesterase 4A
Synonyms:
3',5'-cyclic phosphodiesterase PDE46 PDE4A_HUMAN Phosphodiesterase 4A | Phosphodiesterase 4A (PDE4)
Type:
Enzyme
Mol. Mass.:
98113.27
Organism:
Homo sapiens (Human)
Description:
P27815
Residue:
886
  
Inhibitor
Name:
BDBM50085135
Synonyms:
4-(8-(3-nitrophenyl)-1,7-naphthyridin-6-yl)benzoic acid 4-[8-(3-nitrophenyl)-1,7-naphthyridin-6-yl]benzoic acid | CHEMBL74078
Type:
Small organic molecule
Emp. Form.:
C21H13N3O4
Mol. Mass.:
371.3456
SMILES:
OC(=O)c1ccc(cc1)-c1cc2cccnc2c(n1)-c1cccc(c1)[N+]([O-])=O
: