Target
Potassium voltage-gated channel subfamily H member 2
Ligand
BDBM50002009
Substrate
Meas. Tech.
ChEBML_158542
IC50
204±n/a nM
Citation
 Pearlstein, RAVaz, RJKang, JChen, XLPreobrazhenskaya, MShchekotikhin, AEKorolev, AMLysenkova, LNMiroshnikova, OVHendrix, JRampe, D Characterization of HERG potassium channel inhibition using CoMSiA 3D QSAR and homology modeling approaches. Bioorg Med Chem Lett 13:1829-35 (2003)  
Target
Name:
Potassium voltage-gated channel subfamily H member 2
Synonyms:
1,3-beta-glucan synthase component GLS2 ERG Eag-related protein 1 Ether-a-go-go-related gene (HERG) Ether-a-go-go-related gene potassium channel 1 Ether-a-go-go-related gene potassium channel 1 (hERG1) Ether-a-go-go-related protein 1 H-ERG KCNH2 Potassium voltage-gated channel subfamily H member 2 (hERG) Voltage-gated potassium channel subunit Kv11.1 hERG Potassium Channel 1 | putative potassium channel subunit
Type:
Multi-pass membrane protein
Mol. Mass.:
126672.65
Organism:
Homo sapiens (Human)
Description:
Q12809
Residue:
1159
  
Inhibitor
Name:
BDBM50002009
Synonyms:
5-Chloro-1-(4-fluoro-phenyl)-3-piperidin-4-yl-1H-indole | CHEMBL273235
Type:
Small organic molecule
Emp. Form.:
C19H18ClFN2
Mol. Mass.:
328.811
SMILES:
Fc1ccc(cc1)-n1cc(C2CCNCC2)c2cc(Cl)ccc12
: