Target
Potassium voltage-gated channel subfamily H member 2
Ligand
BDBM50017376
Substrate
Meas. Tech.
ChEBML_158542
IC50
56±n/a nM
Citation
 Pearlstein, RAVaz, RJKang, JChen, XLPreobrazhenskaya, MShchekotikhin, AEKorolev, AMLysenkova, LNMiroshnikova, OVHendrix, JRampe, D Characterization of HERG potassium channel inhibition using CoMSiA 3D QSAR and homology modeling approaches. Bioorg Med Chem Lett 13:1829-35 (2003)  
Target
Name:
Potassium voltage-gated channel subfamily H member 2
Synonyms:
1,3-beta-glucan synthase component GLS2 ERG Eag-related protein 1 Ether-a-go-go-related gene (HERG) Ether-a-go-go-related gene potassium channel 1 Ether-a-go-go-related gene potassium channel 1 (hERG1) Ether-a-go-go-related protein 1 H-ERG KCNH2 Potassium voltage-gated channel subfamily H member 2 (hERG) Voltage-gated potassium channel subunit Kv11.1 hERG Potassium Channel 1 | putative potassium channel subunit
Type:
Multi-pass membrane protein
Mol. Mass.:
126672.65
Organism:
Homo sapiens (Human)
Description:
Q12809
Residue:
1159
  
Inhibitor
Name:
BDBM50017376
Synonyms:
(+/-)1-(4-tert-butylphenyl)-4-(4-(hydroxydiphenylmethyl)piperidin-1-yl)butan-1-ol 1-(4-tert-Butyl-phenyl)-4-[4-(hydroxy-diphenyl-methyl)-piperidin-1-yl]-butan-1-ol(Terfenadine) CHEMBL17157 teraenadine
Type:
Small organic molecule
Emp. Form.:
C32H41NO2
Mol. Mass.:
471.6734
SMILES:
CC(C)(C)c1ccc(cc1)C(O)CCCN1CCC(CC1)C(O)(c1ccccc1)c1ccccc1
: