Target
Potassium voltage-gated channel subfamily H member 2
Ligand
BDBM50127999
Substrate
Meas. Tech.
ChEBML_158542
IC50
6.2±n/a nM
Citation
 Pearlstein, RAVaz, RJKang, JChen, XLPreobrazhenskaya, MShchekotikhin, AEKorolev, AMLysenkova, LNMiroshnikova, OVHendrix, JRampe, D Characterization of HERG potassium channel inhibition using CoMSiA 3D QSAR and homology modeling approaches. Bioorg Med Chem Lett 13:1829-35 (2003)  
Target
Name:
Potassium voltage-gated channel subfamily H member 2
Synonyms:
1,3-beta-glucan synthase component GLS2 ERG Eag-related protein 1 Ether-a-go-go-related gene (HERG) Ether-a-go-go-related gene potassium channel 1 Ether-a-go-go-related gene potassium channel 1 (hERG1) Ether-a-go-go-related protein 1 H-ERG KCNH2 Potassium voltage-gated channel subfamily H member 2 (hERG) Voltage-gated potassium channel subunit Kv11.1 hERG Potassium Channel 1 | putative potassium channel subunit
Type:
Multi-pass membrane protein
Mol. Mass.:
126672.65
Organism:
Homo sapiens (Human)
Description:
Q12809
Residue:
1159
  
Inhibitor
Name:
BDBM50127999
Synonyms:
1-(2-{4-[1-(4-Fluoro-phenyl)-1H-indol-3-yl]-piperidin-1-yl}-ethyl)-imidazolidine-2-thione | CHEMBL298978
Type:
Small organic molecule
Emp. Form.:
C24H27FN4S
Mol. Mass.:
422.561
SMILES:
Fc1ccc(cc1)-n1cc(C2CCN(CCN3CCNC3=S)CC2)c2ccccc12
: