Target
Potassium voltage-gated channel subfamily H member 2
Ligand
BDBM50128001
Substrate
Meas. Tech.
ChEBML_158542
IC50
137±n/a nM
Citation
 Pearlstein, RAVaz, RJKang, JChen, XLPreobrazhenskaya, MShchekotikhin, AEKorolev, AMLysenkova, LNMiroshnikova, OVHendrix, JRampe, D Characterization of HERG potassium channel inhibition using CoMSiA 3D QSAR and homology modeling approaches. Bioorg Med Chem Lett 13:1829-35 (2003)  
Target
Name:
Potassium voltage-gated channel subfamily H member 2
Synonyms:
1,3-beta-glucan synthase component GLS2 ERG Eag-related protein 1 Ether-a-go-go-related gene (HERG) Ether-a-go-go-related gene potassium channel 1 Ether-a-go-go-related gene potassium channel 1 (hERG1) Ether-a-go-go-related protein 1 H-ERG KCNH2 Potassium voltage-gated channel subfamily H member 2 (hERG) Voltage-gated potassium channel subunit Kv11.1 hERG Potassium Channel 1 | putative potassium channel subunit
Type:
Multi-pass membrane protein
Mol. Mass.:
126672.65
Organism:
Homo sapiens (Human)
Description:
Q12809
Residue:
1159
  
Inhibitor
Name:
BDBM50128001
Synonyms:
1-{2-[4-(5-Chloro-1-cyclohexyl-1H-indol-3-yl)-piperidin-1-yl]-ethyl}-imidazolidin-2-one | CHEMBL53661
Type:
Small organic molecule
Emp. Form.:
C24H33ClN4O
Mol. Mass.:
428.998
SMILES:
Clc1ccc2n(cc(C3CCN(CCN4CCNC4=O)CC3)c2c1)C1CCCCC1
: