Target
cGMP-specific 3',5'-cyclic phosphodiesterase
Ligand
BDBM50130024
Substrate
Meas. Tech.
ChEBML_155194
IC50
0.520000±n/a nM
Citation
 Ukita, TNakamura, YKubo, AYamamoto, YMoritani, YSaruta, KHigashijima, TKotera, JFujishige, KTakagi, MKikkawa, KOmori, K 1,7- and 2,7-naphthyridine derivatives as potent and highly specific PDE5 inhibitors. Bioorg Med Chem Lett 13:2341-5 (2003)  
Target
Name:
cGMP-specific 3',5'-cyclic phosphodiesterase
Synonyms:
CGB-PDE PDE5A Phosphodiesterase 5A cGMP-specific 3',5'-cyclic phosphodiesterase
Type:
PROTEIN
Mol. Mass.:
98285.03
Organism:
Canis lupus familiaris
Description:
ChEMBL_105565
Residue:
865
  
Inhibitor
Name:
BDBM50130024
Synonyms:
2-(2-Methyl-pyridin-4-ylmethyl)-1-oxo-8-(2-pyridin-2-yl-ethoxy)-4-(3,4,5-trimethoxy-phenyl)-1,2-dihydro-[2,7]naphthyridine-3-carboxylic acid methyl ester with 2moles of hydrochloride | CHEMBL539783
Type:
Small organic molecule
Emp. Form.:
C33H32N4O7
Mol. Mass.:
596.6298
SMILES:
COC(=O)c1c(-c2cc(OC)c(OC)c(OC)c2)c2ccnc(OCCc3ccccn3)c2c(=O)n1Cc1ccnc(C)c1
: