Target
cGMP-specific 3',5'-cyclic phosphodiesterase
Ligand
BDBM50366818
Substrate
Meas. Tech.
ChEBML_155194
IC50
1.8±n/a nM
Citation
 Ukita, TNakamura, YKubo, AYamamoto, YMoritani, YSaruta, KHigashijima, TKotera, JFujishige, KTakagi, MKikkawa, KOmori, K 1,7- and 2,7-naphthyridine derivatives as potent and highly specific PDE5 inhibitors. Bioorg Med Chem Lett 13:2341-5 (2003)  
Target
Name:
cGMP-specific 3',5'-cyclic phosphodiesterase
Synonyms:
CGB-PDE PDE5A Phosphodiesterase 5A cGMP-specific 3',5'-cyclic phosphodiesterase
Type:
PROTEIN
Mol. Mass.:
98285.03
Organism:
Canis lupus familiaris
Description:
ChEMBL_105565
Residue:
865
  
Inhibitor
Name:
BDBM50366818
Synonyms:
CHEMBL1202833
Type:
Small organic molecule
Emp. Form.:
C32H31N5O6
Mol. Mass.:
581.6184
SMILES:
COC(=O)c1c(-c2cc(OC)c(OC)c(OC)c2)c2ccc(NCc3ccccn3)nc2c(=O)n1Cc1ccnc(C)c1
: