Target
cGMP-specific 3',5'-cyclic phosphodiesterase
Ligand
BDBM50130016
Substrate
Meas. Tech.
ChEBML_155194
IC50
2.6±n/a nM
Citation
 Ukita, TNakamura, YKubo, AYamamoto, YMoritani, YSaruta, KHigashijima, TKotera, JFujishige, KTakagi, MKikkawa, KOmori, K 1,7- and 2,7-naphthyridine derivatives as potent and highly specific PDE5 inhibitors. Bioorg Med Chem Lett 13:2341-5 (2003)  
Target
Name:
cGMP-specific 3',5'-cyclic phosphodiesterase
Synonyms:
CGB-PDE PDE5A Phosphodiesterase 5A cGMP-specific 3',5'-cyclic phosphodiesterase
Type:
PROTEIN
Mol. Mass.:
98285.03
Organism:
Canis lupus familiaris
Description:
ChEMBL_105565
Residue:
865
  
Inhibitor
Name:
BDBM50130016
Synonyms:
8-(2-Hydroxy-ethylamino)-2-(2-methyl-pyridin-4-ylmethyl)-1-oxo-4-(3,4,5-trimethoxy-phenyl)-1,2-dihydro-[2,7]naphthyridine-3-carboxylic acid methyl ester with 2moles of hydrochloride | CHEMBL541823
Type:
Small organic molecule
Emp. Form.:
C28H30N4O7
Mol. Mass.:
534.5604
SMILES:
COC(=O)c1c(-c2cc(OC)c(OC)c(OC)c2)c2ccnc(NCCO)c2c(=O)n1Cc1ccnc(C)c1
: