Target
Mu-type opioid receptor
Ligand
BDBM50125258
Substrate
Meas. Tech.
ChEMBL_147666 (CHEMBL756580)
Ki
7500±n/a nM
Citation
 Kiddle, JJMcCreery, HJSoles, S Synthesis and binding affinity of neuropeptide Y at opiate receptors. Bioorg Med Chem Lett 13:1029-31 (2003)  
Target
Name:
Mu-type opioid receptor
Synonyms:
M-OR-1 MOR-1 MUOR1 Mu opiate receptor OPRM1 hMOP | mu-type opioid receptor isoform MOR-1
Type:
G Protein-Coupled Receptor (GPCR)
Mol. Mass.:
44789.51
Organism:
Homo sapiens (Human)
Description:
P35372
Residue:
400
  
Inhibitor
Name:
BDBM50125258
Synonyms:
(S)-1-[(S)-6-Amino-2-((S)-2-{[(S)-1-((S)-2-amino-3-phenyl-propionyl)-pyrrolidine-2-carbonyl]-amino}-3-hydroxy-propionylamino)-hexanoyl]-pyrrolidine-2-carboxylic acid | CHEMBL8072
Type:
Small organic molecule
Emp. Form.:
C28H42N6O7
Mol. Mass.:
574.6691
SMILES:
NCCCC[C@H](NC(=O)[C@H](CO)NC(=O)[C@@H]1CCCN1C(=O)[C@@H](N)Cc1ccccc1)C(=O)N1CCC[C@H]1C(O)=O
: