Target
5-hydroxytryptamine receptor 1D
Ligand
BDBM50145337
Substrate
Meas. Tech.
ChEBML_1712
Ki
8.4±n/a nM
Citation
 Timms, GHBoot, JRBroadmore, RJCarney, SLCooper, JFindlay, JDGilmore, JMitchell, SMoore, NAPullar, ISanger, GJTomlinson, RTree, BBWedley, S SAR development of a selective 5-HT1D antagonist/serotonin reuptake inhibitor lead using rapid parallel synthesis. Bioorg Med Chem Lett 14:2469-72 (2004)  
Target
Name:
5-hydroxytryptamine receptor 1D
Synonyms:
5-HT-1D 5-HT1D 5HT1D_HUMAN HTR1DA Serotonin (5-HT) receptor | Serotonin Receptor 1D
Type:
G Protein-Coupled Receptor (GPCR)
Mol. Mass.:
41920.63
Organism:
Homo sapiens (Human)
Description:
Receptor binding assays were performed using human clone stably expressed in CHO cells.
Residue:
377
  
Inhibitor
Name:
BDBM50145337
Synonyms:
1-{2-[4-(6-Fluoro-1H-indol-3-yl)-piperidin-1-yl]-ethyl}-isochroman-6-carboxylic acid amide | CHEMBL79674
Type:
Small organic molecule
Emp. Form.:
C25H28FN3O2
Mol. Mass.:
421.5071
SMILES:
NC(=O)c1ccc2C(CCN3CCC(CC3)c3c[nH]c4cc(F)ccc34)OCCc2c1
: