Target
72 kDa type IV collagenase
Ligand
BDBM50140146
Substrate
Meas. Tech.
ChEBML_104545
IC50
200±n/a nM
Citation
 Delbecq, FCordonnier, GPommery, NBarbry, DHénichart, JP New heteroarylbenzenesulphonamides as matrix metalloproteinase inhibitors. Bioorg Med Chem Lett 14:1119-21 (2004)  
Target
Name:
72 kDa type IV collagenase
Synonyms:
72 kDa gelatinase CLG4A Gelatinase A (MMP-2) MMP2_HUMAN Matrix metalloproteinase-2 (MMP 2) Matrix metalloproteinases 2 (MMP-2) | TBE-1
Type:
Enzyme
Mol. Mass.:
73870.36
Organism:
Homo sapiens (Human)
Description:
P08253
Residue:
660
  
Inhibitor
Name:
BDBM50140146
Synonyms:
(S)-3-((R)-Isobutyl)-4-oxo-6-((R)-phenylmethyl)-2-phenylsulfanylmethyl-heptanedioic acid 1-hydroxyamide 7-methylamide | CHEMBL13927
Type:
Small organic molecule
Emp. Form.:
C26H34N2O4S
Mol. Mass.:
470.624
SMILES:
CNC(=O)[C@@H](CC(=O)[C@H](CC(C)C)[C@H](CSc1ccccc1)C(=O)NO)Cc1ccccc1
: