Target
Matrix metalloproteinase-9
Ligand
BDBM50140148
Substrate
Meas. Tech.
ChEBML_105506
IC50
1000±n/a nM
Citation
 Delbecq, FCordonnier, GPommery, NBarbry, DHénichart, JP New heteroarylbenzenesulphonamides as matrix metalloproteinase inhibitors. Bioorg Med Chem Lett 14:1119-21 (2004)  
Target
Name:
Matrix metalloproteinase-9
Synonyms:
67 kDa matrix metalloproteinase-9 92 kDa gelatinase CLG4B Gelatinase B MMP9 Matrix metalloproteinase 9 (MMP-9) Matrix metalloproteinase-9 (MMP9)
Type:
Enzyme
Mol. Mass.:
78452.28
Organism:
Homo sapiens (Human)
Description:
P14780
Residue:
707
  
Inhibitor
Name:
BDBM50140148
Synonyms:
2-{4-[5-(4-Methoxy-phenyl)-oxazol-2-yl]-benzenesulfonylamino}-3-methyl-butyric acid | CHEMBL275014
Type:
Small organic molecule
Emp. Form.:
C21H22N2O6S
Mol. Mass.:
430.474
SMILES:
COc1ccc(cc1)-c1cnc(o1)-c1ccc(cc1)S(=O)(=O)NC(C(C)C)C(O)=O
: