Target
Matrix metalloproteinase-9
Ligand
BDBM50140146
Substrate
Meas. Tech.
ChEBML_105506
IC50
200±n/a nM
Citation
 Delbecq, FCordonnier, GPommery, NBarbry, DHénichart, JP New heteroarylbenzenesulphonamides as matrix metalloproteinase inhibitors. Bioorg Med Chem Lett 14:1119-21 (2004)  
Target
Name:
Matrix metalloproteinase-9
Synonyms:
67 kDa matrix metalloproteinase-9 92 kDa gelatinase CLG4B Gelatinase B MMP9 Matrix metalloproteinase 9 (MMP-9) Matrix metalloproteinase-9 (MMP9)
Type:
Enzyme
Mol. Mass.:
78452.28
Organism:
Homo sapiens (Human)
Description:
P14780
Residue:
707
  
Inhibitor
Name:
BDBM50140146
Synonyms:
(S)-3-((R)-Isobutyl)-4-oxo-6-((R)-phenylmethyl)-2-phenylsulfanylmethyl-heptanedioic acid 1-hydroxyamide 7-methylamide | CHEMBL13927
Type:
Small organic molecule
Emp. Form.:
C26H34N2O4S
Mol. Mass.:
470.624
SMILES:
CNC(=O)[C@@H](CC(=O)[C@H](CC(C)C)[C@H](CSc1ccccc1)C(=O)NO)Cc1ccccc1
: