Target
72 kDa type IV collagenase
Ligand
BDBM50140151
Substrate
Meas. Tech.
ChEBML_104545
IC50
10000±n/a nM
Citation
 Delbecq, FCordonnier, GPommery, NBarbry, DHénichart, JP New heteroarylbenzenesulphonamides as matrix metalloproteinase inhibitors. Bioorg Med Chem Lett 14:1119-21 (2004)  
Target
Name:
72 kDa type IV collagenase
Synonyms:
72 kDa gelatinase CLG4A Gelatinase A (MMP-2) MMP2_HUMAN Matrix metalloproteinase-2 (MMP 2) Matrix metalloproteinases 2 (MMP-2) | TBE-1
Type:
Enzyme
Mol. Mass.:
73870.36
Organism:
Homo sapiens (Human)
Description:
P08253
Residue:
660
  
Inhibitor
Name:
BDBM50140151
Synonyms:
5-{4-[5-(4-Methoxy-phenyl)-oxazol-2-yl]-benzenesulfonylamino}-6-methyl-4-oxo-heptanoic acid | CHEMBL266612
Type:
Small organic molecule
Emp. Form.:
C24H26N2O7S
Mol. Mass.:
486.537
SMILES:
COc1ccc(cc1)-c1cnc(o1)-c1ccc(cc1)S(=O)(=O)NC(C(C)C)C(=O)CCC(O)=O
: