Target
Matrix metalloproteinase-9
Ligand
BDBM50140151
Substrate
Meas. Tech.
ChEBML_105506
IC50
10000±n/a nM
Citation
 Delbecq, FCordonnier, GPommery, NBarbry, DHénichart, JP New heteroarylbenzenesulphonamides as matrix metalloproteinase inhibitors. Bioorg Med Chem Lett 14:1119-21 (2004)  
Target
Name:
Matrix metalloproteinase-9
Synonyms:
67 kDa matrix metalloproteinase-9 92 kDa gelatinase CLG4B Gelatinase B MMP9 Matrix metalloproteinase 9 (MMP-9) Matrix metalloproteinase-9 (MMP9)
Type:
Enzyme
Mol. Mass.:
78452.28
Organism:
Homo sapiens (Human)
Description:
P14780
Residue:
707
  
Inhibitor
Name:
BDBM50140151
Synonyms:
5-{4-[5-(4-Methoxy-phenyl)-oxazol-2-yl]-benzenesulfonylamino}-6-methyl-4-oxo-heptanoic acid | CHEMBL266612
Type:
Small organic molecule
Emp. Form.:
C24H26N2O7S
Mol. Mass.:
486.537
SMILES:
COc1ccc(cc1)-c1cnc(o1)-c1ccc(cc1)S(=O)(=O)NC(C(C)C)C(=O)CCC(O)=O
: