Target
72 kDa type IV collagenase
Ligand
BDBM50140148
Substrate
Meas. Tech.
ChEBML_104545
IC50
1000±n/a nM
Citation
 Delbecq, FCordonnier, GPommery, NBarbry, DHénichart, JP New heteroarylbenzenesulphonamides as matrix metalloproteinase inhibitors. Bioorg Med Chem Lett 14:1119-21 (2004)  
Target
Name:
72 kDa type IV collagenase
Synonyms:
72 kDa gelatinase CLG4A Gelatinase A (MMP-2) MMP2_HUMAN Matrix metalloproteinase-2 (MMP 2) Matrix metalloproteinases 2 (MMP-2) | TBE-1
Type:
Enzyme
Mol. Mass.:
73870.36
Organism:
Homo sapiens (Human)
Description:
P08253
Residue:
660
  
Inhibitor
Name:
BDBM50140148
Synonyms:
2-{4-[5-(4-Methoxy-phenyl)-oxazol-2-yl]-benzenesulfonylamino}-3-methyl-butyric acid | CHEMBL275014
Type:
Small organic molecule
Emp. Form.:
C21H22N2O6S
Mol. Mass.:
430.474
SMILES:
COc1ccc(cc1)-c1cnc(o1)-c1ccc(cc1)S(=O)(=O)NC(C(C)C)C(O)=O
: