Target
72 kDa type IV collagenase
Ligand
BDBM50140150
Substrate
Meas. Tech.
ChEBML_104545
IC50
400±n/a nM
Citation
 Delbecq, FCordonnier, GPommery, NBarbry, DHénichart, JP New heteroarylbenzenesulphonamides as matrix metalloproteinase inhibitors. Bioorg Med Chem Lett 14:1119-21 (2004)  
Target
Name:
72 kDa type IV collagenase
Synonyms:
72 kDa gelatinase CLG4A Gelatinase A (MMP-2) MMP2_HUMAN Matrix metalloproteinase-2 (MMP 2) Matrix metalloproteinases 2 (MMP-2) | TBE-1
Type:
Enzyme
Mol. Mass.:
73870.36
Organism:
Homo sapiens (Human)
Description:
P08253
Residue:
660
  
Inhibitor
Name:
BDBM50140150
Synonyms:
CHEMBL13974 | N-Hydroxy-2-{4-[5-(4-methoxy-phenyl)-thiazol-2-yl]-benzenesulfonylamino}-3-methyl-butyramide
Type:
Small organic molecule
Emp. Form.:
C21H23N3O5S2
Mol. Mass.:
461.554
SMILES:
COc1ccc(cc1)-c1cnc(s1)-c1ccc(cc1)S(=O)(=O)NC(C(C)C)C(=O)NO
: